{"text_format":"1","workbook":"xlsx","n_sheets":9,"sheets":["Loan Affordability Calculator","Affordability Rate Adjustment","Policy Quick Reference Guide","Income Data","Tax Rates","General Living Expenses","Other Expenses","Minimum Board & Rent","General list options"],"not_rendered":{"charts":0,"images":1,"macros":1,"external_links":0,"defined_names":58,"comments":5,"pivot_tables":0},"unopened":[],"bounds":{"document_bytes":16777216,"sheet_cells":100000,"rows_first":2000,"rows_last":500,"rows_between":2000,"halvings":0,"cell_chars":16384,"cell_head_chars":4096},"cells_cut":0,"cells_raw":0,"read":"whole","date_system":"1900"}

{"sheet":"Loan Affordability Calculator","index":0,"n_rows":131,"n_cols":6,"rows_kept":131,"cut":false,"hidden":false,"merged":[[19,7,26,7],[31,3,33,4],[31,5,33,6],[62,2,62,6],[35,2,35,6],[58,3,60,4],[58,5,60,6],[127,0,128,0],[127,1,128,1],[127,2,128,3],[88,2,88,6],[6,3,6,4],[13,3,13,4],[11,3,11,4],[12,3,12,4],[85,5,87,6],[110,3,112,4],[110,5,112,6],[85,3,87,4],[113,2,113,6]]}
["Loan Affordability Calculator"]
[]
[{"$f":"TODAY()","v":"2019-06-26"}]
["Number of Borrowers"]
["Number of Loans"]
["Loan 1",null,null,"Loan 2"]
["Loan amount",0,null,"Loan amount",null,0]
["Loan Term (Yrs)",0,null,"Loan Term (Yrs)",null,0]
["Interest Only Term (Yrs)",null,null,"Interest Only Term (Yrs)"]
[{"$f":"IF(B10>0,(-PMT('Affordability Rate Adjustment'!Q7/12,'Loan Affordability Calculator'!B10*12,'Loan Affordability Calculator'!B7)),0)","v":0},{"$f":"Loan1_Term__Yrs-('General list options'!$E$7)","v":0},null,{"$f":"IF(F10>0,(-PMT('Affordability Rate Adjustment'!Q7/12,'Loan Affordability Calculator'!F10*12,'Loan Affordability Calculator'!F7)),0)","v":0},null,{"$f":"Loan2_Term__Yrs - ('General list options'!$E$8)","v":0}]
{"$rows_left_out":122}
{"sheet":"Affordability Rate Adjustment","index":1,"n_rows":80,"n_cols":17,"rows_kept":80,"cut":false,"hidden":false,"merged":[[47,6,51,8],[64,0,64,4],[66,6,70,8],[6,6,10,8],[7,0,7,4],[26,0,26,4],[28,6,32,8],[5,0,5,4],[24,0,24,4],[43,0,43,4],[62,0,62,4],[45,0,45,4]]}
["Affordability Rate Adjustment (ARA) Calculator"]
["Notes: Loan Amounts should Include amount available for redraw.  Repayments displayed are per month."]
["Calculator to be used for all mortgage-secured products including secured line of credit facilities and Interest Only loans"]
["Insert current Loan Amount  & actual repayment (entries in red)"]
[]
["Borrower 1 - Other Mortgage Repayments",null,null,null,null,null,null,null,null,null,null,null,null,"Number","Current",null,"Affordability Rate"]
["Number of Mortgage Loans",null,"Click here to return to the Loan Affordability Calculator",null,null,null,"The following amount will be used in the calculation of loan affordability",null,null,null,null,null,null,"Nil",1,null,7.2499999999999995E-2]
[null,null,null,null,null,null,null,null,null,null,null,null,null,1]
[{"$f":"IF(O7=1,\"Not Required\",\"Loan 1\")","v":"Not Required"},null,null,{"$f":"IF(O7=1,\"Not Required\",\"Loan 2\")","v":"Not Required"},null,null,null,null,null,null,null,null,null,2]
["Loan Amount",0,null,"Loan Amount",0,null,null,null,null,null,null,null,null,3]
{"$rows_left_out":71}
{"sheet":"Policy Quick Reference Guide","index":2,"n_rows":10,"n_cols":2,"rows_kept":10,"cut":false,"hidden":true,"merged":[]}
[]
[]
["Minimum Rent/Boarder Expense"]
[]
["Board"]
["$150 per week","All Locations"]
[]
["Rent"]
["Region","Mid Range Median Rent per Week"]
["ACT (including Queanbeyan)",405]
{"$rows_left_out":1}
{"sheet":"Income Data","index":3,"n_rows":66,"n_cols":61,"rows_kept":66,"cut":false,"hidden":true,"merged":[[16,1,16,8],[33,1,33,8],[50,1,50,8],[27,11,27,12],[27,13,27,14],[26,11,26,16],[20,11,20,12],[20,13,20,14],[20,15,20,16],[19,11,19,16],[27,15,27,16],[31,11,31,16],[32,11,32,12],[32,13,32,14],[32,15,32,16],[74,1,74,16],[86,1,86,16],[49,1,49,34],[50,18,50,32],[50,34,50,37],[12,11,12,16],[13,11,13,12],[13,13,13,14],[13,15,13,16],[2,11,2,12],[2,13,2,14],[2,15,2,16],[7,11,7,16],[0,1,0,8],[1,20,1,23],[1,25,1,28],[1,30,1,33],[8,11,8,12],[8,13,8,14],[8,15,8,16],[1,11,1,16],[27,19,27,25],[1,55,1,58],[1,35,1,38],[1,39,1,42],[1,43,1,46],[1,47,1,50],[1,51,1,54]]}
[null,"Borrower 1 Income Type"]
[null,"Income Type 1",null,null,"Income Type 2",null,null,"Income Type 3",null,null,null,"Borrower 1 Net or Gross",null,null,null,null,null,null,null,null,"Primary Income Net (converted to Monthly - ",null,null,null,"Primary Income Gross","Secondary Income Net (converts to Monthly)",null,null,null,"Secondary Income Gross","Self Employed Net",null,null,null,"Self Employed Gross","Rent Metro",null,null,null,"Rent National",null,null,null,"Rent High Density",null,null,null,"Super",null,null,null,"Government benefits",null,null,null,"Child Support"]
[null,"Primary Employment",1,{"$f":"IF(C3=1,'Loan Affordability Calculator'!B20,0)","v":0},"Secondary Employment",9,{"$f":"IF(F3=1,'Loan Affordability Calculator'!B21,0)","v":0},"Secondary Employment",9,{"$f":"IF(I3=1,'Loan Affordability Calculator'!B22,0)","v":0},null,"Income 1",null,"Income 2",null,"Income 3",null,"Response",null,null,"Weekly","Fortnightly","Monthly","Annually","Monthly","Weekly","Fortnightly","Monthly","Annually","Monthly","Weekly","Fortnightly","Monthly","Annually","Monthly","Weekly","Fortnightly","Monthly","Annually","Weekly","Fortnightly","Monthly","Annually","Weekly","Fortnightly","Monthly","Annually","Weekly","Fortnightly","Monthly","Annually","Weekly","Fortnightly","Monthly","Annually","Weekly","Fortnightly","Monthly","Annually"]
[null,"Secondary Employment",null,{"$f":"IF(C3=2,'Loan Affordability Calculator'!B20,0)","v":0},"Self Employed",null,{"$f":"IF(F3=2,'Loan Affordability Calculator'!B21,0)","v":0},"Self Employed",null,{"$f":"IF(I3=2,'Loan Affordability Calculator'!B22,0)","v":0},null,"Gross",1,"Gross",1,"Gross",1,"Week",3,"Income 1",{"$f":"IF(S4=1,((D3*13)/3),0)","v":0},{"$f":"IF(S4=2,(((D3/2)*13)/3),0)","v":0},{"$f":"IF(S4=3,D3,0)","v":0},{"$f":"IF(S4=4,(((D3/52)*13)/3),0)","v":0},{"$f":"'Tax Rates'!F26","v":0},{"$f":"IF(S4=1,((D4*13)/3),0)","v":0},{"$f":"IF(S4=2,(((D4/2)*13)/3),0)","v":0},{"$f":"IF(S4=3,D4,0)","v":0},{"$f":"IF(S4=4,(((D4/52)*13)/3),0)","v":0},{"$f":"'Tax Rates'!L26","v":0},{"$f":"IF(S4=1,((D5*13)/3),0)","v":0},{"$f":"IF(S4=2,(((D5/2)*13)/3),0)","v":0},{"$f":"IF(S4=3,D5,0)","v":0},{"$f":"IF(S4=4,(((D5/52)*13)/3),0)","v":0},{"$f":"'Tax Rates'!R26","v":0},{"$f":"IF(S4=1,((D6*13)/3)*0.8,0)","v":0},{"$f":"IF(S4=2,(((D6/2)*13)/3)*0.8,0)","v":0},{"$f":"IF(S4=3,D6*0.8,0)","v":0},{"$f":"IF(S4=4,(((D6/52)*13)/3)*0.8,0)","v":0},{"$f":"IF(S4=1,((D7*13)/3)*0.7,0)","v":0},{"$f":"IF(S4=2,(((D7/2)*13)/3)*0.7,0)","v":0},{"$f":"IF(S4=3,D7*0.7,0)","v":0},{"$f":"IF(S4=4,(((D7/52)*13)/3)*0.7,0)","v":0},{"$f":"IF(S4=1,((D8*13)/3)*0.5,0)","v":0},{"$f":"IF(S4=2,(((D8/2)*13)/3)*0.5,0)","v":0},{"$f":"IF(S4=3,D8*0.5,0)","v":0},{"$f":"IF(S4=4,(((D8/52)*13)/3)*0.5,0)","v":0},{"$f":"IF(S4=1,((D9*13)/3),0)","v":0},{"$f":"IF(S4=2,(((D9/2)*13)/3),0)","v":0},{"$f":"IF(S4=3,D9,0)","v":0},{"$f":"IF(S4=4,(((D9/52)*13)/3),0)","v":0},{"$f":"IF(S4=1,((D10*13)/3),0)","v":0},{"$f":"IF(S4=2,(((D10/2)*13)/3),0)","v":0},{"$f":"IF(S4=3,D10,0)","v":0},{"$f":"IF(S4=4,(((D10/52)*13)/3),0)","v":0},{"$f":"IF(S4=1,((D11*13)/3),0)*0.8","v":0},{"$f":"IF(S4=2,(((D11/2)*13)/3),0)*0.8","v":0},{"$f":"IF(S4=3,D11,0)*0.8","v":0},{"$f":"IF(S4=4,(((D11/52)*13)/3),0)*0.8","v":0},null,{"$f":"SUM(AJ4:BG4)","v":0}]
[null,"Self Employed",null,{"$f":"IF(C3=3,'Loan Affordability Calculator'!B20,0)","v":0},"Rent (Metro & Regional)",null,{"$f":"IF(F3=3,'Loan Affordability Calculator'!B21,0)","v":0},"Rent (Metro & Regional)",null,{"$f":"IF(I3=3,'Loan Affordability Calculator'!B22,0)","v":0},null,"Net",null,"Net",null,"Net",null,"Fortnight",3,"Income 2",null,null,null,null,null,{"$f":"IF(S5=1,((G3*13)/3),0)","v":0},{"$f":"IF(S5=2,(((G3/2)*13)/3),0)","v":0},{"$f":"IF(S5=3,G3,0)","v":0},{"$f":"IF(S5=4,(((G3/52)*13)/3),0)","v":0},{"$f":"'Tax Rates'!Z26","v":0},{"$f":"IF(S5=1,((G4*13)/3),0)","v":0},{"$f":"IF(S5=2,(((G4/2)*13)/3),0)","v":0},{"$f":"IF(S5=3,G4,0)","v":0},{"$f":"IF(S5=4,(((G4/52)*13)/3),0)","v":0},{"$f":"'Tax Rates'!AD26","v":0},{"$f":"IF(S5=1,((G5*13)/3)*0.8,0)","v":0},{"$f":"IF(S5=2,(((G5/2)*13)/3)*0.8,0)","v":0},{"$f":"IF(S5=3,G5*0.8,0)","v":0},{"$f":"IF(S5=4,(((G5/52)*13)/3)*0.8,0)","v":0},{"$f":"IF(S5=1,((G6*13)/3)*0.7,0)","v":0},{"$f":"IF(S5=2,(((G6/2)*13)/3)*0.7,0)","v":0},{"$f":"IF(S5=3,G6*0.7,0)","v":0},{"$f":"IF(S5=4,(((G6/52)*13)/3)*0.7,0)","v":0},{"$f":"IF(S5=1,((G7*13)/3)*0.5,0)","v":0},{"$f":"IF(S5=2,(((G7/2)*13)/3)*0.5,0)","v":0},{"$f":"IF(S5=3,G7*0.5,0)","v":0},{"$f":"IF(S5=4,(((G7/52)*13)/3)*0.5,0)","v":0},{"$f":"IF(S5=1,((G8*13)/3),0)","v":0},{"$f":"IF(S5=2,(((G8/2)*13)/3),0)","v":0},{"$f":"IF(S5=3,G8,0)","v":0},{"$f":"IF(S5=4,(((G8/52)*13)/3),0)","v":0},{"$f":"IF(S5=1,((G9*13)/3),0)","v":0},{"$f":"IF(S5=2,(((G9/2)*13)/3),0)","v":0},{"$f":"IF(S5=3,G9,0)","v":0},{"$f":"IF(S5=4,(((G9/52)*13)/3),0)","v":0},{"$f":"IF(S5=1,((G10*13)/3),0)*0.8","v":0},{"$f":"IF(S5=2,(((G10/2)*13)/3),0)*0.8","v":0},{"$f":"IF(S5=3,G10,0)*0.8","v":0},{"$f":"IF(S5=4,(((G10/52)*13)/3),0)*0.8","v":0},null,{"$f":"SUM(AJ5:BG5)","v":0}]
[null,"Rent (Metro & Regional)",null,{"$f":"IF(C3=4,'Loan Affordability Calculator'!B20,0)","v":0},"Rent (National & Commercial)",null,{"$f":"IF(F3=4,'Loan Affordability Calculator'!B21,0)","v":0},"Rent (National & Commercial)",null,{"$f":"IF(I3=4,'Loan Affordability Calculator'!B22,0)","v":0},null,null,null,null,null,null,null,"Month",3,"Income 3",null,null,null,null,null,{"$f":"IF(S6=1,((J3*13)/3),0)","v":0},{"$f":"IF(S6=2,(((J3/2)*13)/3),0)","v":0},{"$f":"IF(S6=3,J3,0)","v":0},{"$f":"IF(S6=4,(((J3/52)*13)/3),0)","v":0},{"$f":"'Tax Rates'!AI26","v":0},{"$f":"IF(S6=1,((J4*13)/3),0)","v":0},{"$f":"IF(S6=2,(((J4/2)*13)/3),0)","v":0},{"$f":"IF(S6=3,J4,0)","v":0},{"$f":"IF(S6=4,(((J4/52)*13)/3),0)","v":0},{"$f":"'Tax Rates'!AM26","v":0},{"$f":"IF(S6=1,((J5*13)/3)*0.8,0)","v":0},{"$f":"IF(S6=2,(((J5/2)*13)/3)*0.8,0)","v":0},{"$f":"IF(S6=3,J5*0.8,0)","v":0},{"$f":"IF(S6=4,(((J5/52)*13)/3)*0.8,0)","v":0},{"$f":"IF(S6=1,((J6*13)/3)*0.7,0)","v":0},{"$f":"IF(S6=2,(((J6/2)*13)/3)*0.7,0)","v":0},{"$f":"IF(S6=3,J6*0.7,0)","v":0},{"$f":"IF(S6=4,(((J6/52)*13)/3)*0.7,0)","v":0},{"$f":"IF(S6=1,((J7*13)/3)*0.5,0)","v":0},{"$f":"IF(S6=2,(((J7/2)*13)/3)*0.5,0)","v":0},{"$f":"IF(S6=3,J7*0.5,0)","v":0},{"$f":"IF(S6=4,(((J7/52)*13)/3)*0.5,0)","v":0},{"$f":"IF(S6=1,((J8*13)/3),0)","v":0},{"$f":"IF(S6=2,(((J8/2)*13)/3),0)","v":0},{"$f":"IF(S6=3,J8,0)","v":0},{"$f":"IF(S6=4,(((J8/52)*13)/3),0)","v":0},{"$f":"IF(S6=1,((J9*13)/3),0)","v":0},{"$f":"IF(S6=2,(((J9/2)*13)/3),0)","v":0},{"$f":"IF(S6=3,J9,0)","v":0},{"$f":"IF(S6=4,(((J9/52)*13)/3),0)","v":0},{"$f":"IF(S6=1,((J10*13)/3),0)*0.8","v":0},{"$f":"IF(S6=2,(((J10/2)*13)/3),0)*0.8","v":0},{"$f":"IF(S6=3,J10,0)*0.8","v":0},{"$f":"IF(S6=4,(((J10/52)*13)/3),0)*0.8","v":0},null,{"$f":"SUM(AJ6:BG6)","v":0}]
[null,"Rent (National & Commercial)",null,{"$f":"IF(C3=5,'Loan Affordability Calculator'!B20,0)","v":0},"Rent (High Density Serviced Apartment)",null,{"$f":"IF(F3=5,'Loan Affordability Calculator'!B21,0)","v":0},"Rent (High Density Serviced Apartment)",null,{"$f":"IF(I3=5,'Loan Affordability Calculator'!B22,0)","v":0},null,null,null,null,null,null,null,"Annually"]
[null,"Rent (High Density Serviced Apartment)",null,{"$f":"IF(C3=6,'Loan Affordability Calculator'!B20,0)","v":0},"Superannuation",null,{"$f":"IF(F3=6,'Loan Affordability Calculator'!B21,0)","v":0},"Superannuation",null,{"$f":"IF(I3=6,'Loan Affordability Calculator'!B22,0)","v":0},null,"Borrower 2 Net or Gross",null,null,null,null,null,"Response",null,null,"Weekly","Fortnightly","Monthly","Annually","Monthly","Weekly","Fortnightly","Monthly","Annually","Monthly","Weekly","Fortnightly","Monthly","Annually","Monthly","Weekly","Fortnightly","Monthly","Annually","Weekly","Fortnightly","Monthly","Annually","Weekly","Fortnightly","Monthly","Annually","Weekly","Fortnightly","Monthly","Annually","Weekly","Fortnightly","Monthly","Annually","Weekly","Fortnightly","Monthly","Annually"]
[null,"Superannuation",null,{"$f":"IF(C3=7,'Loan Affordability Calculator'!B20,0)","v":0},"Government Benefits",null,{"$f":"IF(F3=7,'Loan Affordability Calculator'!B21,0)","v":0},"Government Benefits",null,{"$f":"IF(I3=7,'Loan Affordability Calculator'!B22,0)","v":0},null,"Income 1",null,"Income 2",null,"Income 3",null,"Week",3,"Income 1",{"$f":"IF(S9=1,((D19*13)/3),0)","v":0},{"$f":"IF(S9=2,(((D19/2)*13)/3),0)","v":0},{"$f":"IF(S9=3,D19,0)","v":0},{"$f":"IF(S9=4,(((D19/52)*13)/3),0)","v":0},{"$f":"'Tax Rates'!F82","v":0},{"$f":"IF(S9=1,((D20*13)/3),0)","v":0},{"$f":"IF(S9=2,(((D20/2)*13)/3),0)","v":0},{"$f":"IF(S9=3,D20,0)","v":0},{"$f":"IF(S9=4,(((D20/52)*13)/3),0)","v":0},{"$f":"'Tax Rates'!L82","v":0},{"$f":"IF(S9=1,((D21*13)/3),0)","v":0},{"$f":"IF(S9=2,(((D21/2)*13)/3),0)","v":0},{"$f":"IF(S9=3,D21,0)","v":0},{"$f":"IF(S9=4,(((D21/52)*13)/3),0)","v":0},{"$f":"'Tax Rates'!R82","v":0},{"$f":"IF(S9=1,((D22*13)/3)*0.8,0)","v":0},{"$f":"IF(S9=2,(((D22/2)*13)/3)*0.8,0)","v":0},{"$f":"IF(S9=3,D22*0.8,0)","v":0},{"$f":"IF(S9=4,(((D22/52)*13)/3)*0.8,0)","v":0},{"$f":"IF(S9=1,((D23*13)/3)*0.7,0)","v":0},{"$f":"IF(S9=2,(((D23/2)*13)/3)*0.7,0)","v":0},{"$f":"IF(S9=3,D23*0.7,0)","v":0},{"$f":"IF(S9=4,(((D23/52)*13)/3)*0.7,0)","v":0},{"$f":"IF(S9=1,((D24*13)/3)*0.5,0)","v":0},{"$f":"IF(S9=2,(((D24/2)*13)/3)*0.5,0)","v":0},{"$f":"IF(S9=3,D24*0.5,0)","v":0},{"$f":"IF(S9=4,(((D24/52)*13)/3)*0.5,0)","v":0},{"$f":"IF(S9=1,((D25*13)/3),0)","v":0},{"$f":"IF(S9=2,(((D25/2)*13)/3),0)","v":0},{"$f":"IF(S9=3,D25,0)","v":0},{"$f":"IF(S9=4,(((D25/52)*13)/3),0)","v":0},{"$f":"IF(S9=1,((D26*13)/3),0)","v":0},{"$f":"IF(S9=2,(((D26/2)*13)/3),0)","v":0},{"$f":"IF(S9=3,D26,0)","v":0},{"$f":"IF(S9=4,(((D26/52)*13)/3),0)","v":0},{"$f":"IF(S9=1,((D27*13)/3),0)*0.8","v":0},{"$f":"IF(S9=2,(((D27/2)*13)/3),0)*0.8","v":0},{"$f":"IF(S9=3,D27,0)*0.8","v":0},{"$f":"IF(S9=4,(((D27/52)*13)/3),0)*0.8","v":0},null,{"$f":"SUM(AJ9:BG9)","v":0}]
[null,"Government Benefits",null,{"$f":"IF(C3=8,'Loan Affordability Calculator'!B20,0)","v":0},"Child Support",null,{"$f":"IF(F3=8,'Loan Affordability Calculator'!B21,0)","v":0},"Child Support",null,{"$f":"IF(I3=8,'Loan Affordability Calculator'!B22,0)","v":0},null,"Gross",1,"Gross",1,"Gross",1,"Fortnight",3,"Income 2",null,null,null,null,null,{"$f":"IF(S10=1,((G19*13)/3),0)","v":0},{"$f":"IF(S10=2,(((G19/2)*13)/3),0)","v":0},{"$f":"IF(S10=3,G19,0)","v":0},{"$f":"IF(S10=4,(((G19/52)*13)/3),0)","v":0},{"$f":"'Tax Rates'!Z82","v":0},{"$f":"IF(S10=1,((G20*13)/3),0)","v":0},{"$f":"IF(S10=2,G20*26/12,0)","v":0},{"$f":"IF(S10=3,G20,0)","v":0},{"$f":"IF(S10=4,(((G20/52)*13)/3),0)","v":0},{"$f":"'Tax Rates'!AD82","v":0},{"$f":"IF(S10=1,((G21*13)/3)*0.8,0)","v":0},{"$f":"IF(S10=2,(((G21/2)*13)/3)*0.8,0)","v":0},{"$f":"IF(S10=3,G21*0.8,0)","v":0},{"$f":"IF(S10=4,(((G21/52)*13)/3)*0.8,0)","v":0},{"$f":"IF(S10=1,((G22*13)/3)*0.7,0)","v":0},{"$f":"IF(S10=2,(((G22/2)*13)/3)*0.7,0)","v":0},{"$f":"IF(S10=3,G22*0.7,0)","v":0},{"$f":"IF(S10=4,(((G22/52)*13)/3)*0.7,0)","v":0},{"$f":"IF(S10=1,((G23*13)/3)*0.5,0)","v":0},{"$f":"IF(S10=2,(((G23/2)*13)/3)*0.5,0)","v":0},{"$f":"IF(S10=3,G23*0.5,0)","v":0},{"$f":"IF(S10=4,(((G23/52)*13)/3)*0.5,0)","v":0},{"$f":"IF(S10=1,((G24*13)/3),0)","v":0},{"$f":"IF(S10=2,(((G24/2)*13)/3),0)","v":0},{"$f":"IF(S10=3,G24,0)","v":0},{"$f":"IF(S10=4,(((G24/52)*13)/3),0)","v":0},{"$f":"IF(S10=1,((G25*13)/3),0)","v":0},{"$f":"IF(S10=2,(((G25/2)*13)/3),0)","v":0},{"$f":"IF(S10=3,G25,0)","v":0},{"$f":"IF(S10=4,(((G25/52)*13)/3),0)","v":0},{"$f":"IF(S10=1,((G26*13)/3),0)*0.8","v":0},{"$f":"IF(S10=2,(((G26/2)*13)/3),0)*0.8","v":0},{"$f":"IF(S10=3,G26,0)*0.8","v":0},{"$f":"IF(S10=4,(((G26/52)*13)/3),0)*0.8","v":0},null,{"$f":"SUM(AJ10:BG10)","v":0}]
{"$rows_left_out":57}
{"sheet":"Tax Rates","index":4,"n_rows":209,"n_cols":39,"rows_kept":209,"cut":false,"hidden":true,"merged":[[174,27,174,29],[174,32,174,34],[174,36,174,38],[174,3,174,5],[174,9,174,11],[174,15,174,17],[174,19,174,21],[174,23,174,25],[124,27,124,29],[124,32,124,34],[124,36,124,38],[162,19,162,23],[124,3,124,5],[124,9,124,11],[124,15,124,17],[124,19,124,21],[124,23,124,25],[73,27,73,29],[73,32,73,34],[73,36,73,38],[112,19,112,23],[61,19,61,23],[73,3,73,5],[73,9,73,11],[73,15,73,17],[73,19,73,21],[73,23,73,25],[17,32,17,34],[17,36,17,38],[16,4,16,39],[17,15,17,17],[17,3,17,5],[17,9,17,11],[17,19,17,21],[17,23,17,25],[4,2,4,7],[5,2,5,7],[5,10,5,14],[17,27,17,29],[4,10,4,14]]}
[null,null,null,null,null,null,null,null,null,null,null,null,null,null,"Tax Calculator"]
[]
[]
[]
[null,null,"TAX RATES (Primary Income)",null,null,null,null,null,null,null,"TAX RATES (Secondary Employment - No Tax Free Threshold)"]
[null,null,"Where the employee claimed the tax-free threshold in Tax file number declaration\nSCALE 2",null,null,null,null,null,null,null,"Where the tax-free threshold is not claimed in Tax file number declaration\nSCALE 1"]
[null,null,"Weekly earnings (x) less than \n$","Weekly earnings equal or greater than $","a","b",null,null,null,null,"Weekly earnings (x) less than \n$","Weekly earnings equal or greater than \n$","a","b"]
[null,null,355,0,0,0,null,null,null,null,72,0,0.19,0.19]
[null,null,422,355,0.19,67.463499999999996,null,null,null,null,361,72,0.23419999999999999,3.2130000000000001]
[null,null,528,422,0.28999999999999998,109.73269999999999,null,null,null,null,932,361,0.34770000000000001,44.247599999999998,null,null,null,20.5,19]
{"$rows_left_out":200}
{"sheet":"General Living Expenses","index":5,"n_rows":57,"n_cols":25,"rows_kept":57,"cut":false,"hidden":true,"merged":[[6,1,6,3],[6,7,6,9],[6,13,6,15],[6,19,6,21]]}
["Number of Borrowers"]
[1,1]
[2]
[3,null,{"$f":"IF(B2=1,\"No\",IF(B2=2,\"No\",\"Yes\"))","v":"No"}]
[4,null,{"$f":"IF(B2=4,\"Yes\",\"No\")","v":"No"}]
[null,"Expense Application type"]
[null,"Borrower 1",null,null,null,null,null,"Borrower 2",null,null,null,null,null,"Borrower 3",null,null,null,null,null,"Borrower 4"]
[null,"Index","Options","Current",null,null,null,"Index","Options","Current",null,null,null,"Index","Options","Current",null,null,null,"Index","Options","Current"]
[null,1,"Single",1,null,null,null,1,"Single",3,null,null,null,1,"Single",3,null,null,null,1,"Single",3]
[null,2,"Married or Defacto",null,null,null,null,2,"Married or Defacto",null,null,null,null,2,"Married or Defacto",null,null,null,null,2,"Married or Defacto"]
{"$rows_left_out":48}
{"sheet":"Other Expenses","index":6,"n_rows":79,"n_cols":22,"rows_kept":79,"cut":false,"hidden":true,"merged":[[89,0,89,14],[106,0,106,1],[0,0,0,14],[60,0,60,14],[21,0,21,14],[41,0,41,14],[61,0,61,14]]}
["Borrower 1"]
[null,"Rent/Board",null,"Frequency",null,null,null,"Other Expense 2",null,"Frequency",null,"Other Expense 3",null,"Frequency",null,null,null,"Minimum Board",null,null,"Credit Card Repayment Period (mths)","Credit Card Repayment Rate"]
[null,"Rent",3,"Weekly",3,null,null,"Private School Fees",5,"Weekly",3,"Private School Fees",5,"Weekly",3,null,null,null,null,null,36,0.22]
[null,"Board",null,"Fortnightly",null,null,null,"Child Support/Maintenance",null,"Fortnightly",null,"Child Support/Maintenance",null,"Fortnightly"]
[null,"N/A",null,"Monthly",null,null,null,"HECS/HELP",null,"Monthly",null,"HECS/HELP",null,"Monthly",null,null,null,null,null,null,"Beyond Bank Credit Card Repayment Period (mths)","Beyond Bank Credit Card Repayment Rate"]
[null,null,null,null,null,null,null,"Other  ",null,null,null,"Other  ",null,null,null,null,null,null,null,null,36,0.22]
["Amount",{"$f":"'Loan Affordability Calculator'!$B$32","v":0},null,null,null,null,null,"N/A",null,null,null,"N/A"]
["Used",{"$f":"IF(E3=1,B7*52/12,IF(E3=2,B7*26/12,IF(E3=3,B7,0)))","v":0}]
[null,null,null,null,null,null,"Amount",{"$f":"'Loan Affordability Calculator'!$B$33","v":0},null,null,"Amount",{"$f":"'Loan Affordability Calculator'!$B$34","v":0}]
[null,null,null,null,null,null,"Used",{"$f":"IF(K3=1,H9*52/12,IF(K3=2,H9*26/12,IF(K3=3,H9,0)))","v":0},null,null,"Used",{"$f":"IF(O3=1,L9*52/12,IF(O3=2,L9*26/12,IF(O3=3,L9,0)))","v":0}]
{"$rows_left_out":70}
{"sheet":"Minimum Board & Rent","index":7,"n_rows":3,"n_cols":3,"rows_kept":3,"cut":false,"hidden":true,"merged":[]}
[]
[null,null,"Minimum Weekly Amount"]
[null,"Board"]

{"sheet":"General list options","index":8,"n_rows":17,"n_cols":6,"rows_kept":17,"cut":false,"hidden":true,"merged":[]}
["Sheet","Field","Input Range","Cell Link (selection  from drop down list - i.e. the position not the value)"]
["Loan Affordability Calculator","Number of Loans",1,1]
[null,null,2]
[null,null,3]
[null,null,4]
[]
["Loan Affordability Calculator","Interest Only Term (Yrs)",0,1,{"$f":"INDEX($C$7:$C$17,D7)","v":0},"Loan 1 Value"]
[null,null,1,1,{"$f":"INDEX($C$7:$C$17,D8)","v":0},"Loan 2 Value"]
[null,null,2,1,{"$f":"INDEX($C$7:$C$17,D9)","v":0},"Loan 3 Value"]
[null,null,3,1,{"$f":"INDEX($C$7:$C$17,D10)","v":0},"Loan 4 Value"]
{"$rows_left_out":7}